Jump to content
Cesbo Community
  • Announcements

    • RadioSintetica

      Information   10/21/18

      Registration on the forum temporarily closed! For support requests, please contacat us: https://cesbo.com/help
      Our community in Telegram: @cesbo_en (English language) , @cesbo_ru (Russian language) , @cesbo_es (Spanish Language)

SergP

Members
  • Content count

    2
  • Joined

  • Last visited

  1. TBS 6909

    Обновил ядро. git clone https://bitbucket.org/CrazyCat/media_build.git И снова аналогично, не накладываются патчи при билде. Потом взял руками вытянул с радела https://bitbucket.org/CrazyCat/media_build/downloads Download repository и только после этого собралось(возможно и на предыдущем кернеле бы собралось, еслиб сразу вытянул ручками репозитарий). Попутный вопрос, количество адаптеров 32 выставить можно полсе билда в linux/drivers/media/dvb-core/Kconfig? Upd. В машине с 6909 стоит TBS 6991SE, в /dev/dvb/adapter4 отсутствует -ca0, соответсвенно кам модуль не видно. Аналогично не видно кам модуля при установке с https://github.com/tbsdtv/linux_media/wiki
  2. TBS 6909

    Подскажите, пожалуйста, в чем проблема не происходит билд(CentOS Linux release 7.2.1511 (Core)). ****************** * Start building * ****************** make -C /var/compile/sss/media_build/v4l allyesconfig make[1]: Entering directory `/var/compile/sss/media_build/v4l' make[2]: Entering directory `/var/compile/sss/media_build/linux' Applying patches for kernel 3.10.0-327.28.3.el7.x86_64 patch -s -f -N -p1 -i ../backports/api_version.patch patch -s -f -N -p1 -i ../backports/pr_fmt.patch patch -s -f -N -p1 -i ../backports/debug.patch patch -s -f -N -p1 -i ../backports/drx39xxj.patch patch -s -f -N -p1 -i ../backports/v4.7_dma_attrs.patch 4 out of 4 hunks FAILED 9 out of 9 hunks FAILED 7 out of 7 hunks FAILED 1 out of 1 hunk FAILED 3 out of 3 hunks FAILED make[2]: *** [apply_patches] Error 1 make[2]: Leaving directory `/var/compile/sss/media_build/linux' make[1]: *** [allyesconfig] Error 2 make[1]: Leaving directory `/var/compile/sss/media_build/v4l' make: *** [allyesconfig] Error 2 can't select all drivers at ./build line 511.
×